N-Ethyl-N-methyl-benzamide

Kovats' RI, non-polar column, isothermal

Data compiled by: NIST Mass Spectrometry Data Center, William E. Wallace, director

Column type CapillaryCapillaryCapillaryCapillary
Active phase DB-1DB-1DB-5DB-5
Column length (m) 30.30.60.60.
Carrier gas N2N2N2N2
Substrate
Column diameter (mm) 0.2560.2560.3210.321
Phase thickness (μm) 0.250.250.250.25
Temperature (C) 170.190.170.190.
I 1439.621459.871461.711482.2
ReferenceAntonovic, Mijin, et al., 2000Antonovic, Mijin, et al., 2000Antonovic, Mijin, et al., 2000Antonovic, Mijin, et al., 2000
Comment MSDC-RI MSDC-RI MSDC-RI MSDC-RI

References

Antonovic, Mijin, et al., 2000
Antonovic, D.G.; Mijin, D.Z.; Petrovic, S.D.; Stojanovic, N.D.; Nikolic, A.D., Gas chromatographic retention indices for the N-methyl-N-substituted benzamides on capillary columns, Indian J. Chem., 2000, 39B, 694-699. [all data]