N-(2,2-dimethylpropyl)-N-methyl-benzamide

Kovats' RI, non-polar column, isothermal

View large format table.

Column type Active phase Temperature (C) I Reference Comment
CapillaryDB-1170.1606.54Antonovic, Mijin, et al., 200030. m/0.256 mm/0.25 μm, N2
CapillaryDB-1190.1625.88Antonovic, Mijin, et al., 200030. m/0.256 mm/0.25 μm, N2
CapillaryDB-5170.1637.79Antonovic, Mijin, et al., 200060. m/0.321 mm/0.25 μm, N2
CapillaryDB-5190.1657.39Antonovic, Mijin, et al., 200060. m/0.321 mm/0.25 μm, N2

Kovats' RI, polar column, isothermal

View large format table.

Column type Active phase Temperature (C) I Reference Comment
CapillaryDB-Wax170.2472.23Antonovic, Mijin, et al., 200030. m/0.234 mm/0.25 μm, N2
CapillaryDB-Wax190.2491.77Antonovic, Mijin, et al., 200030. m/0.234 mm/0.25 μm, N2
CapillaryDB-Wax210.2510.89Antonovic, Mijin, et al., 200030. m/0.234 mm/0.25 μm, N2

References

Antonovic, Mijin, et al., 2000
Antonovic, D.G.; Mijin, D.Z.; Petrovic, S.D.; Stojanovic, N.D.; Nikolic, A.D., Gas chromatographic retention indices for the N-methyl-N-substituted benzamides on capillary columns, Indian J. Chem., 2000, 39B, 694-699. [all data]