α-Methyl butanoyl fentanyl

Normal alkane RI, non-polar column, temperature ramp

View large format table.

Column type Active phase I Reference Comment
CapillaryCBP-12930.Ohta, Suzuki, et al., 199950. m/0.20 mm/0.25 μm, N2, 10. K/min; Tstart: 100. C; Tend: 320. C

References

Ohta, Suzuki, et al., 1999
Ohta, H.; Suzuki, S.; Ogasawara, K., Studies on fentanyl and related compounds. IV. Chromatographic and spectrometric discrimination of fentanyl and its derivatives, J. Anal. Toxicol., 1999, 23, 4, 280-285, https://doi.org/10.1093/jat/23.4.280 . [all data]