3,4,7-trimethyl-dibenzothiophene

Lee's RI, non-polar column, temperature ramp

View large format table.

Column type Active phase I Reference Comment
CapillaryDB-5MS354.95Schade and Andersson, 200630. m/0.25 mm/0.25 μm, He, 60. C @ 1. min, 10. K/min; Tend: 300. C

Lee's RI, non-polar column, custom temperature program

View large format table.

Column type Active phase I Reference Comment
CapillaryDB-5352.91Mössner, de Alda, et al., 199960. m/0.25 mm/0.25 μm, He; Program: 60C (1 min) => 45 C/min => 150C (2 min) => 2 C/min => 300 C (25 min)

References

Schade and Andersson, 2006
Schade, T.; Andersson, J.T., Speciation of alkylated dibenzothiophenes through correlation of structure and gas chromatographic retention indexes, J. Chromatogr. A, 2006, 1117, 2, 206-213, https://doi.org/10.1016/j.chroma.2006.03.079 . [all data]

Mössner, de Alda, et al., 1999
Mössner, S.G.; de Alda, M.J.L.; Sander, L.C.; Lee, M.L.; Wise, S.A., Gas chromatographic retention behavior of polycyclic aromatic sulfur heterocyclic compounds, (dibenzothiophene, naphtho[b]thiophenes, benzo[b]naphthothiophenes and alkyl-substituted derivatives) on stationary phases of different selectivity, J. Chromatogr. A, 1999, 841, 2, 207-228, https://doi.org/10.1016/S0021-9673(99)00363-5 . [all data]