Diamyl ethyl amine

Kovats' RI, non-polar column, isothermal

View large format table.

Column type Active phase Temperature (C) I Reference Comment
PackedApiezon L80.1196.Zhuravleva, Golovnya, et al., 1981Chromosorb G AW (80-100 mesh); Column length: 2.7 m
PackedApiezon L80.1174.6Zhuravleva, Golovnya, et al., 1981Chromosorb G AW (80-100 mesh); Column length: 2.7 m

References

Zhuravleva, Golovnya, et al., 1981
Zhuravleva, I.L.; Golovnya, R.V.; Terenina, M.B.; Grigorieva, D.N., Gas chromatographic behaviour of some unsymmetrical tertiary amines, Zh. Anal. Khim., 1981, 36, 968-975. [all data]