GA24, Me-TMS

Van Den Dool and Kratz RI, non-polar column, custom temperature program

View large format table.

Column type Active phase I Reference Comment
CapillaryOV-12426.Davis, Kobayashi, et al., 199925. m/0.2 mm/0.25 μm, He; Program: 60C(2min) => 10C/min => 150C => 3C/min => 300C(10min)

Normal alkane RI, non-polar column, custom temperature program

View large format table.

Column type Active phase I Reference Comment
CapillaryDB-12456.Chung, Kuo, et al., 200315. m/0.25 mm/0.25 μm; Program: 60 0C (0.1 min) 20 0C -> 200 0C 5 0C/min -> 300 0C
CapillaryPolydimethyl siloxane2447.Tanno, Nakayama, et al., 1995Program: not specified
CapillaryUltra 22445.Talon, Zacarias, et al., 199222. m/0.32 mm/0.52 μm, Helium; Program: not specified

References

Davis, Kobayashi, et al., 1999
Davis, G.; Kobayashi, M.; Phinney, B.O.; Lange, T.; Croker, S.J.; Gaskin, P.; MacMillan, J., Gibberellin biosynthesis in maize. Metabolic studies with GA15, GA24, GA25, GA7, and 2,3-dehydro-GA9, Plant Physiol., 1999, 121, 3, 1037-1045, https://doi.org/10.1104/pp.121.3.1037 . [all data]

Chung, Kuo, et al., 2003
Chung, J.-D.; Kuo, S.-R.; Chien, C.-T., Identification and quantification of gibberellin transformation and dosage changes in good and poor flowering clones of Calocedrus formosana grafts, Taiwan J. For. Sci., 2003, 18, 4, 387-400. [all data]

Tanno, Nakayama, et al., 1995
Tanno, N.; Nakayama, M.; Kurosawa, H.; Wakatsuki, M.; Tanno, M.; Abe, M.; Okagami, N.; Yokota, T., Endogenous gibberellins from three East Asian Stenophora species of the genus Dioscorea (Yams), Z. Naturforsch., 1995, 50c, 193-198. [all data]

Talon, Zacarias, et al., 1992
Talon, M.; Zacarias, L.; PRimo-Millo, E., Gibberellins and Partenocarpic ability in developing ovaries of seedless mandarins, Plant Physiol., 1992, 99, 4, 1575-1581, https://doi.org/10.1104/pp.99.4.1575 . [all data]