GA15, Me-TMS

Van Den Dool and Kratz RI, non-polar column, custom temperature program

View large format table.

Column type Active phase I Reference Comment
CapillaryOV-12587.Davis, Kobayashi, et al., 199925. m/0.2 mm/0.25 μm, He; Program: 60C(2min) => 10C/min => 150C => 3C/min => 300C(10min)

Normal alkane RI, non-polar column, custom temperature program

View large format table.

Column type Active phase I Reference Comment
CapillaryDB-12588.Nishijima, Murakami, et al., 199315; Column diameter: 0.257 mm; Phase thickness: 0.25 μm; Program: not specified
CapillaryOV-12594.Yamane, Fujioka, et al., 198825. m/0.20 mm/0.25 μm; Program: not specified
CapillaryOV-12594.Yamane, Fujioka, et al., 198825. m/0.20 mm/0.25 μm; Program: not specified
CapillaryOV-12594.Yamane, Fujioka, et al., 198825. m/0.20 mm/0.25 μm; Program: not specified

References

Davis, Kobayashi, et al., 1999
Davis, G.; Kobayashi, M.; Phinney, B.O.; Lange, T.; Croker, S.J.; Gaskin, P.; MacMillan, J., Gibberellin biosynthesis in maize. Metabolic studies with GA15, GA24, GA25, GA7, and 2,3-dehydro-GA9, Plant Physiol., 1999, 121, 3, 1037-1045, https://doi.org/10.1104/pp.121.3.1037 . [all data]

Nishijima, Murakami, et al., 1993
Nishijima, T.; Murakami, F.; Koshioka, M.; Yamazaki, H., Endogenous gibberellins in Aralia cordata, Japan Society for Biosci. Biotechnol. Agrochem., 1993, 57, 1, 1953-1954, https://doi.org/10.1271/bbb.57.1953 . [all data]

Yamane, Fujioka, et al., 1988
Yamane, H.; Fujioka, S.; Spray, C.R.; Phinney, B.O.; MacMillan, J.; Gaskin, P.; Takahashi, N., Endogenous Gibberellines from Sporophytes of Two Tree Ferns, Cibotium glaucum and Dicksonia antarctica, Plant Phisiol., 1988, 86, 3, 857-862, https://doi.org/10.1104/pp.86.3.857 . [all data]