Isobicyclogermacrene

Normal alkane RI, non-polar column, temperature ramp

View large format table.

Column type Active phase I Reference Comment
CapillaryCP Sil 5 CB1463.Asekun and Ekundayo, 199925. m/0.25 mm/0.15 μm, H2, 3. K/min; Tstart: 50. C; Tend: 320. C

Normal alkane RI, non-polar column, custom temperature program

View large format table.

Column type Active phase I Reference Comment
CapillaryDB-51489.Courtois, Paine, et al., 200930. m/0.25 mm/0.25 μm, Helium; Program: 50 0C m6 0C/min -> 140 0C 5 0C/min -> 160 0C (1 min) 10 0C/min -> 200 0C

References

Asekun and Ekundayo, 1999
Asekun, O.T.; Ekundayo, O., Constituents of the leaf essential oil of Cedrela odorata L. from Nigeria, Flavour Fragr. J., 1999, 14, 6, 390-392, https://doi.org/10.1002/(SICI)1099-1026(199911/12)14:6<390::AID-FFJ850>3.0.CO;2-3 . [all data]

Courtois, Paine, et al., 2009
Courtois, E.A.; Paine, C.E.; Blandinieres, P.-A.; Stien, D.; Bessiere, J.-M.; Houel, E.; Baraloto, C.; Chave, J., Diversity of the volatile organic compounds emitted by 55 species of tropical trees: a survey in French Guiana, J. Chem. Ecol., 2009, 35, 11, 1349-1362, https://doi.org/10.1007/s10886-009-9718-1 . [all data]