5α,17β-Dihydrotestosterone tetradecanoate

Kovats' RI, non-polar column, isothermal

View large format table.

Column type Active phase Temperature (C) I Reference Comment
CapillaryDB-1299.3995.69Stránsky, Sídová, et al., 199830. m/0.25 mm/0.25 μm, H2

References

Stránsky, Sídová, et al., 1998
Stránsky, K.; Sídová, R.; Kohout, L., Gas chromatography of esters of dihydrotestosterone and dihydroepitestosterone, J. Hi. Res. Chromatogr., 1998, 21, 7, 417-420, https://doi.org/10.1002/(SICI)1521-4168(19980701)21:7<417::AID-JHRC417>3.0.CO;2-B . [all data]