5α,17β-Dihydrotestosterone decanoate

Kovats' RI, non-polar column, isothermal

Data compiled by: NIST Mass Spectrometry Data Center, William E. Wallace, director

Column type Capillary
Active phase DB-1
Column length (m) 30.
Carrier gas H2
Substrate
Column diameter (mm) 0.25
Phase thickness (μm) 0.25
Temperature (C) 271.
I 3526.54
ReferenceStránsky, Sídová, et al., 1998
Comment MSDC-RI

References

Stránsky, Sídová, et al., 1998
Stránsky, K.; Sídová, R.; Kohout, L., Gas chromatography of esters of dihydrotestosterone and dihydroepitestosterone, J. Hi. Res. Chromatogr., 1998, 21, 7, 417-420, https://doi.org/10.1002/(SICI)1521-4168(19980701)21:7<417::AID-JHRC417>3.0.CO;2-B . [all data]