Phenyl-4-nitrophenyl-hydroxyacetic acid, methyl ester

Kovats' RI, non-polar column, isothermal

View large format table.

Column type Active phase Temperature (C) I Reference Comment
CapillaryHP-5200.2285.Soják, Perjéssy, et al., 19988. m/0.32 mm/0.17 μm, He
CapillaryHP-5200.2285.Soják, Perjéssy, et al., 19958. m/0.320 mm/0.17 μm, He

Van Den Dool and Kratz RI, non-polar column, temperature ramp

View large format table.

Column type Active phase I Reference Comment
CapillaryHP-52261.Soják, Perjéssy, et al., 19958. m/0.320 mm/0.17 μm, He, 10. K/min; Tstart: 110. C; Tend: 300. C

References

Soják, Perjéssy, et al., 1998
Soják, L.; Perjéssy, A.; Kubinec, R.; Giumanini, A.G., CGC-FTIR characterization of mononitro and dinitro isomers from nitration mixtures of methyl arylacetates, Chem. Pap., 1998, 52, 1, 34-40. [all data]

Soják, Perjéssy, et al., 1995
Soják, L.; Perjéssy, A.; Kubinec, R.; Giumanini, A.G.; Strazzolini, P., Identification of the isomers from mono- and dinitration of α-hydroxydiphenylacetic acid by capillary gas chromatography with Fourier transform infrared and mass spectrometric detection, J. Chromatogr. A, 1995, 695, 1, 57-64, https://doi.org/10.1016/0021-9673(94)01156-9 . [all data]