Lilac alcohol

Normal alkane RI, non-polar column, temperature ramp

Data compiled by: NIST Mass Spectrometry Data Center, William E. Wallace, director

Column type CapillaryCapillaryCapillary
Active phase ZB-5ZB-5ZB-5
Column length (m) 60.60.60.
Carrier gas HeHeHe
Substrate
Column diameter (mm) 0.250.250.25
Phase thickness (μm) 0.250.250.25
Tstart (C) 40.40.40.
Tend (C) 260.260.260.
Heat rate (K/min) 6.6.6.
Initial hold (min) 4.64.64.6
Final hold (min) 1.1.1.
I 1227.1239.1243.
ReferenceJürgens and Dötterl, 2004Jürgens and Dötterl, 2004Jürgens and Dötterl, 2004
Comment MSDC-RI MSDC-RI MSDC-RI

References

Jürgens and Dötterl, 2004
Jürgens, A.; Dötterl, S., Chemical composition of anther volatiles in Ranunculaceae: genera-specific profiles in Aemone, Aquilegia, Caltha, Pulsatilla, Ranunculus, and Trollius species, American Journal of Botany, 2004, 91, 12, 1969-1980, https://doi.org/10.3732/ajb.91.12.1969 . [all data]