2-(2-(2-(2-(2-(2-Pentoxy-ethoxy)-ethoxy)-ethoxy)-ethoxy)-ethoxy)-ethoxy)-ethyl TMS ether

Van Den Dool and Kratz RI, non-polar column, temperature ramp

View large format table.

Column type Active phase I Reference Comment
CapillaryDB-52801.6Komárek, Richter, et al., 1998He, 5.5 K/min; Column length: 20. m; Column diameter: 0.25 mm; Tstart: 50. C; Tend: 350. C

References

Komárek, Richter, et al., 1998
Komárek, K.; Richter, P.; Hoffmann, J., Capillary gas chromatography of n-butyl and isobutyl-, n-amyl and isoamyl polyethylene glycol ethers and their derivatives, J. Chromatogr. A, 1998, 800, 2, 305-315, https://doi.org/10.1016/S0021-9673(97)01144-8 . [all data]