5-acetyl-2,3-dihydro-1,4-thiazine

Van Den Dool and Kratz RI, non-polar column, custom temperature program

View large format table.

Column type Active phase I Reference Comment
CapillaryDB-51372.Engel and Schieberle, 200230. m/0.32 mm/0.25 μm, He; Program: 40C (2min) => 40C/min => 60C (1min) => 6C/min => 230C (15min)
CapillarySE-541374.Hofmann and Schieberle, 199830. m/0.32 mm/0.25 μm; Program: 35C(2min) => 40C/min => 50C(5min) => 6C/min => 230C(15min)
CapillarySE-541374.Hofmann and Schieberle, 199730. m/0.32 mm/0.25 μm, He; Program: 40C (2min) => 40C/min => 50C (5min) => 6C/min => 230C (15min)
CapillarySE-541374.Hofmann and Schieberle, 199730. m/0.32 mm/0.25 μm, He; Program: 40C (2min) => 40C/min => 50C (5min) => 6C/min => 230C (15min)
CapillarySE-541374.Hofmann and Schieberle, 199530. m/0.32 mm/0.25 μm, He; Program: 40C (2min) => 40C/min => 50C (5min) => 6C/min => 230C (15min)

Van Den Dool and Kratz RI, polar column, custom temperature program

View large format table.

Column type Active phase I Reference Comment
CapillaryFFAP2177.Hofmann and Schieberle, 199830. m/0.32 mm/0.25 μm; Program: 35C(2min) => 40C/min => 60C(5min) => 6C/min => 230C(15min)
CapillaryFFAP2177.Hofmann and Schieberle, 199730. m/0.32 mm/0.25 μm, He; Program: 40C (2min) => 40C/min => 60C (5min) => 6C/min => 230C (15min)
CapillaryFFAP2177.Hofmann and Schieberle, 199730. m/0.32 mm/0.25 μm, He; Program: 40C (2min) => 40C/min => 60C (5min) => 6C/min => 230C (15min)
CapillaryFFAP2177.Hofmann and Schieberle, 199530. m/0.32 mm/0.25 μm, He; Program: 40C (2min) => 40C/min => 60C (5min) => 6C/min => 230C (15min)
CapillaryFFAP2177.Hofmann and Schieberle, 199530. m/0.32 mm/0.25 μm, He; Program: 40C (2min) => 40C/min => 60C (5min) => 6C/min => 230C (15min)

References

Engel and Schieberle, 2002
Engel, W.; Schieberle, P., Identification and quantitation of key aroma compounds formed in Maillard-type reactions of fructose with cysteamine or isothiaproline (1,3-thiazolidine-2-carboxylic acid), J. Agric. Food Chem., 2002, 50, 19, 5394-5399, https://doi.org/10.1021/jf0203186 . [all data]

Hofmann and Schieberle, 1998
Hofmann, T.; Schieberle, P., Identification of key aroma compounds generated from cysteine and carbohydrates under roasting conditions, Z. Lebensm. Unters. Forsch. A, 1998, 207, 3, 229-236, https://doi.org/10.1007/s002170050324 . [all data]

Hofmann and Schieberle, 1997
Hofmann, T.; Schieberle, P., Identification of potent aroma compounds in thermally treated mixtures of glucose/cysteine and rhamnose/cysteine using aroma extract dilution techniques, J. Agric. Food Chem., 1997, 45, 3, 898-906, https://doi.org/10.1021/jf960456t . [all data]

Hofmann and Schieberle, 1995
Hofmann, T.; Schieberle, P., Evaluation of the key odorants in a thermally treated solution of ribose and cysteine by aroma extract dilution techniques, J. Agric. Food Chem., 1995, 43, 8, 2187-2194, https://doi.org/10.1021/jf00056a042 . [all data]