2-acetyl-2-methylthiazolidine
- Formula: C6H11NOS
- Molecular weight: 145.223
- IUPAC Standard InChIKey: WLXIBDDBHZVOIL-UHFFFAOYSA-N
- Chemical structure:

Normal alkane RI, non-polar column, temperature ramp

Column type | Active phase | I | Reference | Comment |
---|---|---|---|---|
Capillary | SPB-1 | 1134. | Huang, Su, et al., 1998 | 60. m/0.32 mm/0.25 μm, He, 4. K/min; Tstart: 80. C; Tend: 200. C |

Normal alkane RI, non-polar column, custom temperature program

Column type | Active phase | I | Reference | Comment |
---|---|---|---|---|
Capillary | DB-5 | 1155. | Didzbalis and Ho, 2001 | 60. m/0.25 mm/0.25 μm, Helium; Program: 35 0C (2 min) 30 0C/min -> 60 0C (1 min) 6 0C/min -> 250 0C (10 min) |

Normal alkane RI, polar column, temperature ramp

Column type | Active phase | I | Reference | Comment |
---|---|---|---|---|
Capillary | DB-Wax | 1789. | Umano, Hagi, et al., 1995 | He, 40. C @ 2. min, 2. K/min; Column length: 60. m; Column diameter: 0.25 mm; Tend: 200. C |
Capillary | DB-Wax | 1789. | Umano, Hagi, et al., 1995 | He, 40. C @ 2. min, 2. K/min; Column length: 60. m; Column diameter: 0.25 mm; Tend: 200. C |

References

Huang, Su, et al., 1998
Huang, T.-C.; Su, Y.-M.; Ho, C.-T.,
Mechanistic studies on the formation of thiazolidine and structurally related thiazines in a cysteamine/2,3-butanedione model system,
J. Agric. Food Chem., 1998, 46, 2, 664-667, https://doi.org/10.1021/jf970602a
. [all data]
Didzbalis and Ho, 2001
Didzbalis, J.; Ho, C.-T.,
Analysis of low molecular weight aldehydes formed during the Mallard reaction,
ACS Symposium Series, 2001, 794, 196-107. [all data]
Umano, Hagi, et al., 1995
Umano, K.; Hagi, Y.; Nakahara, K.; Shyoji, A.; Shibamoto, T.,
Volatile chemicals formed in the headspace of a heated D-glucose/L-cysteine Maillard model system,
J. Agric. Food Chem., 1995, 43, 8, 2212-2218, https://doi.org/10.1021/jf00056a046
. [all data]