Triphenyleno-di[1,12-bcd:8,9-bcd]thiophene

Lee's RI, non-polar column, temperature ramp

View large format table.

Column type Active phase I Reference Comment
CapillaryDB-5497.9Becker and Colmsjö, 199830. m/0.25 mm/0.25 μm, He, 110. C @ 1. min, 10. K/min, 325. C @ 5. min

Lee's RI, non-polar column, custom temperature program

View large format table.

Column type Active phase I Reference Comment
CapillaryDB-5497.1Becker and Colmsjö, 199830. m/0.25 mm/0.25 μm, He; Program: 110C(1min) => 40C/min => 160C => 10C/min => 300C925min)

References

Becker and Colmsjö, 1998
Becker, G.; Colmsjö, A., Gas chromatography-atomic emission detection for quantification of polycyclic aromatic sulfur heterocycles, Anal. Chim. Acta., 1998, 376, 3, 265-272, https://doi.org/10.1016/S0003-2670(98)00546-7 . [all data]