Naphthalene, 1,2,3,4,6-pentamethyl

Kovats' RI, non-polar column, isothermal

View large format table.

Column type Active phase Temperature (C) I Reference Comment
CapillaryApiezon L200.1864.Klemm, Shabtai, et al., 1981

Lee's RI, non-polar column, temperature ramp

View large format table.

Column type Active phase I Reference Comment
CapillaryHP-1316.62Bastow, Alexander, et al., 199850. m/0.20 mm/0.33 μm, Helium, 3. K/min; Tstart: 60. C; Tend: 300. C
CapillaryDB-5314.65Bastow, Alexander, et al., 199860. m/0.25 mm/0.25 μm, Helium, 3. K/min; Tstart: 60. C; Tend: 300. C

Lee's RI, polar column, temperature ramp

View large format table.

Column type Active phase I Reference Comment
CapillaryBP-20288.87Bastow, Alexander, et al., 199850. m/0.22 mm/0.25 μm, Helium, 3. K/min; Tstart: 70. C; Tend: 220. C

References

Klemm, Shabtai, et al., 1981
Klemm, L.H.; Shabtai, J.; Bodily, K.C., Gas chromatography of some C13-C16 alkylnaphthalenes on Bentone 34, silicone fluid DC 550 and Apiezon L phases, J. Chromatogr., 1981, 206, 2, 372-375, https://doi.org/10.1016/S0021-9673(00)82549-2 . [all data]

Bastow, Alexander, et al., 1998
Bastow, T.P.; Alexander, R.; Sosrowidjojo, I.B.; KAgi, R.I., PEntamethylnaphthalenes and related compounds in sedimentary organic matter, Org. Geochem., 1998, 28, 9/10, 585-595, https://doi.org/10.1016/S0146-6380(98)00018-7 . [all data]