p-Menth-1-en-7,8-diol

Van Den Dool and Kratz RI, polar column, temperature ramp

Data compiled by: NIST Mass Spectrometry Data Center, William E. Wallace, director

Column type CapillaryCapillaryCapillary
Active phase DB-WaxDB-WaxDB-Wax
Column length (m) 30.30.30.
Carrier gas HeHe
Substrate
Column diameter (mm) 0.320.320.32
Phase thickness (μm) 0.50.50.5
Tstart (C) 60.60.60.
Tend (C) 245.245.245.
Heat rate (K/min) 3.3.3.
Initial hold (min) 3.3.3.
Final hold (min) 20.20.20.
I 2528.2517.2519.
ReferenceWirth, Guo, et al., 2001Bureau, Baumes, et al., 2000Bureau, Razungles, et al., 2000
Comment MSDC-RI MSDC-RI MSDC-RI

Van Den Dool and Kratz RI, polar column, custom temperature program

Data compiled by: NIST Mass Spectrometry Data Center, William E. Wallace, director

Column type Capillary
Active phase Carbowax 20M
Column length (m) 25.
Carrier gas H2
Substrate
Column diameter (mm) 0.32
Phase thickness (μm) 0.25
Program 40C (8min) => 3C/min => 180C => 20C/min => 230C
I 2528.
ReferenceBoido, Lloret, et al., 2003
Comment MSDC-RI

Normal alkane RI, non-polar column, custom temperature program

Data compiled by: NIST Mass Spectrometry Data Center, William E. Wallace, director

Column type Capillary
Active phase CP Sil 5 CB
Column length (m) 25.
Carrier gas N2
Substrate
Column diameter (mm)
Phase thickness (μm) 0.39
Program not specified
I 1431.
ReferenceWeyerstahl, Marschall, et al., 1998
Comment MSDC-RI

References

Wirth, Guo, et al., 2001
Wirth, J.; Guo, W.; Baumes, R.; Günata, Z., Volatile compounds released by enzymatic hydrolysis of glycoconjugates of leaves and grape berries from Vitis vinifera muscat of Alexandria and Shiraz cultivars, J. Agric. Food Chem., 2001, 49, 6, 2917-2923, https://doi.org/10.1021/jf001398l . [all data]

Bureau, Baumes, et al., 2000
Bureau, S.M.; Baumes, R.L.; Razungles, A.J., Effects of vine or bunch shading on the glycosylated flavor precursors in grapes of Vitis vinifera L. Cv. Syrah, J. Agric. Food Chem., 2000, 48, 4, 1290-1297, https://doi.org/10.1021/jf990507x . [all data]

Bureau, Razungles, et al., 2000
Bureau, S.M.; Razungles, A.R.; Baumes, R.L., The aroma of Muscat of Frontignan grapes: effect of the light environment of vine or bunch on volatiles and glycoconjugates, J. Sci. Food Agric., 2000, 80, 14, 2012-2020, https://doi.org/10.1002/1097-0010(200011)80:14<2012::AID-JSFA738>3.0.CO;2-X . [all data]