(Z)-Linalol furanoxide β-D-glucopyranoside, TFA

Van Den Dool and Kratz RI, non-polar column, temperature ramp

View large format table.

Column type Active phase I Reference Comment
CapillaryDB-51784.Sakho, Chassagne, et al., 1997H2, 60. C @ 3. min, 2. K/min; Column length: 30. m; Column diameter: 0.25 mm; Tend: 220. C

Van Den Dool and Kratz RI, non-polar column, custom temperature program

View large format table.

Column type Active phase I Reference Comment
CapillaryDB-51784.Boulanger, Chassagne, et al., 199930. m/0.25 mm/0.25 μm, H2; Program: 125C => 3C/min => 220C => 2C/min => 280C

References

Sakho, Chassagne, et al., 1997
Sakho, M.; Chassagne, D.; Crouzet, J., African mango glycosidically bound volatile compounds, J. Agric. Food Chem., 1997, 45, 3, 883-888, https://doi.org/10.1021/jf960277b . [all data]

Boulanger, Chassagne, et al., 1999
Boulanger, R.; Chassagne, D.; Crouzet, J., Free and bound flavour components of amazonian fruits. 1: Bacuri, Flavour Fragr. J., 1999, 14, 5, 303-311, https://doi.org/10.1002/(SICI)1099-1026(199909/10)14:5<303::AID-FFJ834>3.0.CO;2-C . [all data]