Eugenol, β-D-glucopyranoside, TFA

Van Den Dool and Kratz RI, non-polar column, custom temperature program

Data compiled by: NIST Mass Spectrometry Data Center, William E. Wallace, director

Column type CapillaryCapillaryCapillary
Active phase DB-5MSDB-5MSDB-5
Column length (m) 30.30.30.
Carrier gas HeHeH2
Substrate
Column diameter (mm) 0.250.250.25
Phase thickness (μm) 0.250.25
Program 125C => 3C/min => 220C => 2C/min => 280C125C => 3C/min => 220C => 2C/min => 280Cnot specified
I 2032.2039.2039.
ReferenceChassagne, Crouzet, et al., 1998Chassagne, Crouzet, et al., 1998Sakho, Chassagne, et al., 1997
Comment MSDC-RI MSDC-RI MSDC-RI

References

Chassagne, Crouzet, et al., 1998
Chassagne, D.; Crouzet, J.; Bayonove, C.L.; Baumes, R.L., Identification of passion fruit glycosides by gas chromatography/mass spectrometry, J. Agric. Food Chem., 1998, 46, 10, 4352-4357, https://doi.org/10.1021/jf980416k . [all data]

Sakho, Chassagne, et al., 1997
Sakho, M.; Chassagne, D.; Crouzet, J., African mango glycosidically bound volatile compounds, J. Agric. Food Chem., 1997, 45, 3, 883-888, https://doi.org/10.1021/jf960277b . [all data]