9-Hydroxymegastigma-4,6-dien-3-one (isomer # 1), β-D-glucopyranoside, TFA

Van Den Dool and Kratz RI, non-polar column, temperature ramp

View large format table.

Column type Active phase I Reference Comment
CapillaryDB-52201.Sakho, Chassagne, et al., 1997H2, 60. C @ 3. min, 2. K/min; Column length: 30. m; Column diameter: 0.25 mm; Tend: 220. C

References

Sakho, Chassagne, et al., 1997
Sakho, M.; Chassagne, D.; Crouzet, J., African mango glycosidically bound volatile compounds, J. Agric. Food Chem., 1997, 45, 3, 883-888, https://doi.org/10.1021/jf960277b . [all data]