Perfluoro-pentan ethioic acid S-butyl ester

Kovats' RI, non-polar column, isothermal

View large format table.

Column type Active phase Temperature (C) I Reference Comment
CapillarySE-30100.946.Kirichencko, Osipova, et al., 1997He; Column length: 25. m; Column diameter: 0.25 mm
CapillarySE-30120.941.Kirichencko, Osipova, et al., 1997He; Column length: 25. m; Column diameter: 0.25 mm
CapillarySE-30140.931.Kirichencko, Osipova, et al., 1997He; Column length: 25. m; Column diameter: 0.25 mm
CapillarySE-3080.953.Kirichencko, Osipova, et al., 1997He; Column length: 25. m; Column diameter: 0.25 mm

Kovats' RI, polar column, isothermal

View large format table.

Column type Active phase Temperature (C) I Reference Comment
CapillaryCarbowax 20M100.1008.Kirichencko, Osipova, et al., 1997He; Column length: 25. m; Column diameter: 0.25 mm
CapillaryCarbowax 20M120.983.Kirichencko, Osipova, et al., 1997He; Column length: 25. m; Column diameter: 0.25 mm
CapillaryCarbowax 20M140.957.Kirichencko, Osipova, et al., 1997He; Column length: 25. m; Column diameter: 0.25 mm
CapillaryCarbowax 20M160.945.Kirichencko, Osipova, et al., 1997He; Column length: 25. m; Column diameter: 0.25 mm

References

Kirichencko, Osipova, et al., 1997
Kirichencko, V.E.; Osipova, O.A.; Pashkevich, K.I., Gas-liquid chromatography of thioesters of perfluorocarboxylic acids. 1. Characteristics of retention, Russ. Chem. Bull. (Engl. Transl.), 1997, 46, 5, 944-946, https://doi.org/10.1007/BF02496124 . [all data]