Homochenodeoxycholic acid, acetate-methyl ester

Normal alkane RI, non-polar column, temperature ramp

View large format table.

Column type Active phase I Reference Comment
CapillaryCP Sil 5 CB3408.Batta, Salen, et al., 1997He, 35. K/min; Column length: 25. m; Column diameter: 0.22 mm; Tstart: 100. C; Tend: 278. C

References

Batta, Salen, et al., 1997
Batta, A.K.; Salen, G.; Batta, M.; Earnest, D.; Alberts, D., Capillary gas-liquid chromatography of acetate-methyl esters of bile acids, J. Chromatogr. A, 1997, 766, 1-2, 286-291, https://doi.org/10.1016/S0021-9673(96)01016-3 . [all data]