ethyl 4-hydroxybutanoate

Van Den Dool and Kratz RI, polar column, custom temperature program

Data compiled by: NIST Mass Spectrometry Data Center, William E. Wallace, director

Column type CapillaryCapillaryCapillaryCapillary
Active phase DB-WaxDB-WaxDB-WaxCarbowax 20M
Column length (m) 30.30.30.25.
Carrier gas H2H2H2H2
Substrate
Column diameter (mm) 0.320.320.320.32
Phase thickness (μm) 0.50.50.50.25
Program 60C(3min) => 2C/min => 220C => 3C/min => 245C (20min)60C(3min) => 2C/min => 220C => 3C/min => 245C(20min)60C(3min) => 2C/min => 220C => 3C/min => 245C (20min)40C (8min) => 3C/min => 180C => 20C/min => 230C
I 1819.1819.1819.1822.
ReferenceSelli, Canbas, et al., 2006Selli, Canbas, et al., 2006, 2Selli, Cabaroglu, et al., 2004Boido, Lloret, et al., 2003
Comment MSDC-RI MSDC-RI MSDC-RI MSDC-RI

Normal alkane RI, polar column, temperature ramp

Data compiled by: NIST Mass Spectrometry Data Center, William E. Wallace, director

Column type CapillaryCapillaryCapillary
Active phase DB-WaxDB-WaxSupelcowax-10
Column length (m) 30.60.60.
Carrier gas HeHeH2
Substrate
Column diameter (mm) 0.250.250.32
Phase thickness (μm) 0.250.250.5
Tstart (C) 40.40.35.
Tend (C) 230.200.250.
Heat rate (K/min) 4.2.5.
Initial hold (min) 2. 5.
Final hold (min) 5. 20.
I 1794.1796.1795.
ReferenceXu, Fan, et al., 2007Wei, Mura, et al., 2001Campeanu, Burcea, et al., 1998
Comment MSDC-RI MSDC-RI MSDC-RI

References

Selli, Canbas, et al., 2006
Selli, S.; Canbas, A.; Cabaroglu, T.; Erten, H.; Gunata, Z., Aroma components of cv. Muscat of Bornova wines and influence of skin contact treatment, Food Chem., 2006, 94, 3, 319-326, https://doi.org/10.1016/j.foodchem.2004.11.019 . [all data]

Selli, Canbas, et al., 2006, 2
Selli, S.; Canbas, A.; Cabaroglu, T.; Erten, H.; Lepoutre, J.-P.; Gunata, Z., Effect of skin contact on the free and bound aroma compounds of the white wine of Vitis vinifera L. cv Narince, Food Control, 2006, 17, 1, 75-82, https://doi.org/10.1016/j.foodcont.2004.09.005 . [all data]

Selli, Cabaroglu, et al., 2004
Selli, S.; Cabaroglu, T.; Canbas, A.; Erten, H.; Nurgel, C.; Lepoutre, J.P.; Gunata, Z., Volatile composition of red wine from cv. Kalecik Karasi grown in central Anatolia, Food Chem., 2004, 85, 2, 207-213, https://doi.org/10.1016/j.foodchem.2003.06.008 . [all data]

Boido, Lloret, et al., 2003
Boido, E.; Lloret, A.; Medina, K.; Fariña, L.; Carrau, f.; Versini, G.; Dellacassa, E., Aroma composition of Vitis vinifera Cv. Tannat: the typical red wine from Uruguay, J. Agric. Food Chem., 2003, 51, 18, 5408-5413, https://doi.org/10.1021/jf030087i . [all data]