4-Methyl-3-thiazoline

Normal alkane RI, non-polar column, custom temperature program

Data compiled by: NIST Mass Spectrometry Data Center, William E. Wallace, director

Column type CapillaryCapillaryCapillary
Active phase RTX-1OV-101DB-5
Column length (m)   30.
Carrier gas
Substrate
Column diameter (mm)   0.32
Phase thickness (μm)
Program not specifiednot specifiednot specified
I 919.919.936.
ReferenceChromTech Pty Ltd, 2006Acree and Arn, 1997Schieberle, 1996
Comment MSDC-RI MSDC-RI MSDC-RI

Normal alkane RI, non-polar column, temperature ramp

Data compiled by: NIST Mass Spectrometry Data Center, William E. Wallace, director

Column type Capillary
Active phase DB-5MS
Column length (m) 30.
Carrier gas He
Substrate
Column diameter (mm) 0.53
Phase thickness (μm) 1.5
Tstart (C) 40.
Tend (C) 225.
Heat rate (K/min) 6.
Initial hold (min) 5.
Final hold (min) 30.
I 956.
ReferenceCadwallader and Heo, 2001
Comment MSDC-RI

References

ChromTech Pty Ltd, 2006
ChromTech Pty Ltd, Retention Data: Rtx-1, Rtx-5, Rtx-50, Rtx-Stab Kovats RI, 2006, retrieved from http://www.chromtech.net.au/pdf/RI-Flavors-20M.pdf. [all data]

Acree and Arn, 1997
Acree, T.; Arn, H., Cornell University Flavornet, 1997, retrieved from http://www.flavornet.org/flavornet.html. [all data]

Schieberle, 1996
Schieberle, P., Odour-active compounds in moderately roasted sesame, Food Chem., 1996, 55, 2, 145-152, https://doi.org/10.1016/0308-8146(95)00095-X . [all data]