(+)-methyldihydroepijasmonate

Normal alkane RI, non-polar column, custom temperature program

Data compiled by: NIST Mass Spectrometry Data Center, William E. Wallace, director

Column type CapillaryCapillaryCapillary
Active phase RTX-1RTX-5OV-101
Column length (m)
Carrier gas
Substrate
Column diameter (mm)
Phase thickness (μm)
Program not specifiednot specifiednot specified
I 1649.1666.1649.
ReferenceChromTech Pty Ltd, 2006ChromTech Pty Ltd, 2006Acree and Arn, 1997
Comment MSDC-RI MSDC-RI MSDC-RI

References

ChromTech Pty Ltd, 2006
ChromTech Pty Ltd, Retention Data: Rtx-1, Rtx-5, Rtx-50, Rtx-Stab Kovats RI, 2006, retrieved from http://www.chromtech.net.au/pdf/RI-Flavors-20M.pdf. [all data]

Acree and Arn, 1997
Acree, T.; Arn, H., Cornell University Flavornet, 1997, retrieved from http://www.flavornet.org/flavornet.html. [all data]