16,17-Dihydro-17-hydroxy GA19, MeTMS

Van Den Dool and Kratz RI, non-polar column, custom temperature program

View large format table.

Column type Active phase I Reference Comment
CapillaryOV-12584.Davis, Kobayashi, et al., 199925. m/0.2 mm/0.25 μm, He; Program: 60C(2min) => 10C/min => 150C => 3C/min => 300C(10min)

Normal alkane RI, non-polar column, custom temperature program

View large format table.

Column type Active phase I Reference Comment
CapillaryHP-12598.Matheussen, Morgan, et al., 199112. m/0.2 mm/0.33 μm, He; Program: 60C(1min) => 15C/min => 200C => 5C/min => 270C

References

Davis, Kobayashi, et al., 1999
Davis, G.; Kobayashi, M.; Phinney, B.O.; Lange, T.; Croker, S.J.; Gaskin, P.; MacMillan, J., Gibberellin biosynthesis in maize. Metabolic studies with GA15, GA24, GA25, GA7, and 2,3-dehydro-GA9, Plant Physiol., 1999, 121, 3, 1037-1045, https://doi.org/10.1104/pp.121.3.1037 . [all data]

Matheussen, Morgan, et al., 1991
Matheussen, A.-M.; Morgan, P.W.; Frederiksen, R.A., Implication of gibberellins in head smut (Sporisorium reilianum) of Sorghum bicolor, Plant Physiol., 1991, 96, 2, 537-544, https://doi.org/10.1104/pp.96.2.537 . [all data]