4-β-Hydro-germacra-1(10),5-diene

Normal alkane RI, non-polar column, temperature ramp

View large format table.

Column type Active phase I Reference Comment
CapillaryDB-51570.9Gawdzik, Mardarowicz, et al., 199630. m/0.25 mm/0.25 μm, 60. C @ 2. min, 4. K/min, 300. C @ 5. min

References

Gawdzik, Mardarowicz, et al., 1996
Gawdzik, J.; Mardarowicz, M.; Suprynowicz, Z.; Kawka, S.; Wolski, T., Supercritical fluid extraction of essential oils from the fruits of Archangelica off. Hoffm. and their characterization by GC/MS, J. Hi. Res. Chromatogr., 1996, 19, 4, 237-240, https://doi.org/10.1002/jhrc.1240190416 . [all data]