Dibenzo[b,e]fluoranthene

Lee's RI, non-polar column, custom temperature program

Data compiled by: NIST Mass Spectrometry Data Center, William E. Wallace, director

Column type CapillaryCapillaryCapillary
Active phase HP-5MSHP-5MSDB-5
Column length (m) 30.30.30.
Carrier gas HeHe
Substrate
Column diameter (mm) 0.250.250.25
Phase thickness (μm) 0.250.250.25
Program 60C(2min) => 6C/min => 258C => 2C/min => 300C(4min)not specifiednot specified
I 533.22533.22553.3
ReferenceWang, Li, et al., 2007Wang, Li, et al., 2007, 2Lundstedt, Haglund, et al., 2003
Comment MSDC-RI MSDC-RI MSDC-RI

References

Wang, Li, et al., 2007
Wang, Z.; Li, K.; Lambert, P.; Yang, C., Identification, characterization and quantitation of pyrogenic polycylic aromatic hydrocarbons and other organic compounds in tire fire products, J. Chromatogr. A, 2007, 1139, 1, 14-26, https://doi.org/10.1016/j.chroma.2006.10.085 . [all data]

Wang, Li, et al., 2007, 2
Wang, Z.; Li, K.; Lambert, P.; Brown, C.E.; Yang, C.; Hollebone, B.P., Identification and characterization of polycyclic aromatic compounds in tire fire products and differentiation of pyrogenic PAHs from petrogenic PAHs in Proceedings of the 30th Arctic and Marine Oilspill (AMOP) Technical Seminar. Vol.1, 2007, 61-85. [all data]

Lundstedt, Haglund, et al., 2003
Lundstedt, S.; Haglund, P.; Öberg, L., Degradation and formation of polycyclic aromatic compounds during bioslurry treatment of an aged gasworks soil, Environ. Toxicol. Chem., 2003, 22, 7, 1413-1420, https://doi.org/10.1002/etc.5620220701 . [all data]