dibenzo[a, k]fluoranthene

Lee's RI, non-polar column, temperature ramp

View large format table.

Column type Active phase I Reference Comment
CapillaryXTI-5535.60Engkvist, Borowski, et al., 199615. m/0.28 mm/0.25 μm, H2, 70. C @ 2. min, 5. K/min; Tend: 350. C

Lee's RI, non-polar column, custom temperature program

View large format table.

Column type Active phase I Reference Comment
Capillary5 % Phenyl methyl siloxane541.12Allen J.O., Durant J.L., et al., 1998Program: not specified

References

Engkvist, Borowski, et al., 1996
Engkvist, O.; Borowski, P.; Bemgård, A.; Karlström, G.; Lindh, R.; Colmsjö, A., On the relation between retention indexes and the interaction between the solute and the column in gas-liquid chromatography, J. Chem. Inf. Comput. Sci., 1996, 36, 6, 1153-1161, https://doi.org/10.1021/ci960345u . [all data]

Allen J.O., Durant J.L., et al., 1998
Allen J.O.; Durant J.L.; Dookeran N.M.; Taghizadeh K.; Plummer E.F.; Lafleur A.L.; Sarofim A.F.; Smith K.A., Measurement of C24H14 polycyclic aromatic hydrocarbons associated with a size-segregated urban aerosol, Environ. Sci. Technol., 1998, 32, 13, 1928-1932, https://doi.org/10.1021/es970919r . [all data]