2-Pentyl-2H-thiapyrane

Van Den Dool and Kratz RI, non-polar column, custom temperature program

Data compiled by: NIST Mass Spectrometry Data Center, William E. Wallace, director

Column type CapillaryCapillaryCapillary
Active phase CP Sil 8 CBDB-5DB-5
Column length (m) 60.50.50.
Carrier gas  HeHe
Substrate
Column diameter (mm) 0.250.320.32
Phase thickness (μm) 0.250.5
Program not specifiedoC(5min) => 60C/min => 60C (5min) => 4C/min => 250C0C => 60C/min => 60C (5min) => 4C/min => 250C
I 1329.1344.1317.
ReferenceElmore and Mottram, 2000Parker, Hassell, et al., 2000Mottram and Whitfield, 1995
Comment MSDC-RI MSDC-RI MSDC-RI

References

Elmore and Mottram, 2000
Elmore, J.S.; Mottram, D.S., Formation of 2-alkyl-(2H)-thiapyrans and 2-Alkylthiophenes in cooked beef and lamb, J. Agric. Food Chem., 2000, 48, 6, 2420-2424, https://doi.org/10.1021/jf000124v . [all data]

Parker, Hassell, et al., 2000
Parker, J.K.; Hassell, G.M.E.; Mottram, D.S.; Guy, R.C.E., Sensory and instrumental analyses of volatiles generated during the extrusion cooking of oat flours, J. Agric. Food Chem., 2000, 48, 8, 3497-3506, https://doi.org/10.1021/jf991302r . [all data]

Mottram and Whitfield, 1995
Mottram, D.S.; Whitfield, F.B., Volatile compounds from the reaction of cysteine, ribose, and phospholipid in low-moisture systems, J. Agric. Food Chem., 1995, 43, 4, 984-988, https://doi.org/10.1021/jf00052a027 . [all data]