5-methylheptacosane

Kovats' RI, non-polar column, isothermal

View large format table.

Column type Active phase Temperature (C) I Reference Comment
CapillaryOV-1255.2753.Hebanowska, Malinski, et al., 1989Ar; Column length: 30. m; Phase thickness: 0.1 μm
CapillaryDexsil 300255.2747.Hebanowska, Malinski, et al., 1989Ar; Column length: 30. m; Phase thickness: 0.1 μm

Van Den Dool and Kratz RI, non-polar column, temperature ramp

View large format table.

Column type Active phase I Reference Comment
CapillaryDB-5MS2750.Steiner, Steidle, et al., 200530. m/0.32 mm/0.25 μm, He, 2. K/min; Tstart: 150. C; Tend: 300. C
CapillaryDB-5MS2747.Steinmetz, Schmolz, et al., 200330. m/0.32 mm/0.25 μm, He, 3. K/min; Tstart: 150. C; Tend: 280. C

Normal alkane RI, non-polar column, temperature ramp

View large format table.

Column type Active phase I Reference Comment
CapillaryDB-12750.3Katritzky, Chen, et al., 200030. m/0.32 mm/0.25 μm; Tstart: 60. C; Tend: 320. C
CapillaryOV-12753.Szafranek, Malinski, et al., 1994Ar, 2. K/min; Column length: 40. m; Tstart: 200. C; Tend: 310. C

Normal alkane RI, non-polar column, custom temperature program

View large format table.

Column type Active phase I Reference Comment
CapillaryHP-52749.Juárez, Carlson, et al., 2002H2; Column length: 30. m; Column diameter: 0.32 mm; Program: 60C (2min) => 20C/min => 180C => 3C/min => 310 C (10min)
CapillaryCP Sil 5 CB2744.Kenig, Sinninghe Damsté, et al., 199525. m/0.32 mm/0.2 μm, He; Program: 50C => 20C/min => 130C => 4C/min => 300C (20min)

References

Hebanowska, Malinski, et al., 1989
Hebanowska, E.; Malinski, E.; Dubis, E.; Pihlaja, K.; Oksman, P.; Winamaki, K.; Nawrot, J.; Szafranek, J., The composition of cuticular hydrocarbons of the Tribolium destructor, Comp. Biochem. Physiol. B: Comp. Biochem., 1989, 93, 2, 437-442. [all data]

Steiner, Steidle, et al., 2005
Steiner, S.; Steidle, J.L.M.; Ruther, J., Female sex pheromone in immature insect males - a case of pre-emergence chemical mimicry?, Behavioral Ecology and Sociobiology, 2005, 58, 2, 111-120, https://doi.org/10.1007/s00265-005-0930-x . [all data]

Steinmetz, Schmolz, et al., 2003
Steinmetz, I.; Schmolz, E.; Ruther, J., Cuticular lipids as trail pheromone in a social wasp, Proc. R. Soc. London B:, 2003, 270, 1513, 385-391, https://doi.org/10.1098/rspb.2002.2256 . [all data]

Katritzky, Chen, et al., 2000
Katritzky, A.R.; Chen, K.; Maran, U.; Carlson, D.A., QSPR Correlation and predictions of GC retention indexes for methyl-branched hydrocarbons produced by insects, Anal. Chem., 2000, 72, 1, 101-109, https://doi.org/10.1021/ac990800w . [all data]

Szafranek, Malinski, et al., 1994
Szafranek, J.; Malinski, E.; Dubis, E.; Hebanowska, E.; Nawrot, J.; Oksman, P.; Pihlaja, K., Identification of branched alkanes in lipids of Leptinotarsa decemlineata say and Tribolium destructor by GC-MS: a comparison of main-beam and link-scanned spectra, J. Chem. Ecol., 1994, 20, 9, 2197-2212, https://doi.org/10.1007/BF02033197 . [all data]

Juárez, Carlson, et al., 2002
Juárez, M.P.; Carlson, D.A.; Schettino, P.M.S.; Mijailovsky, S.; Rojas, G., Cuticular hydrocarbons of Chagas disease vectors in Mexico, Mem. Inst. Oswaldo Cruz., 2002, 97, 6, 819-827, https://doi.org/10.1590/S0074-02762002000600012 . [all data]

Kenig, Sinninghe Damsté, et al., 1995
Kenig, F.; Sinninghe Damsté, J.S.; Kock-van Dalen, A.C.; Rijpstra, W.I.C.; Huc, A.Y.; de Leeuw, J.W., Occurrence and origin of mono-, di-, and trimethylalkanes in modern and holocene cyanobacterial mats from Abu Dhabi, United Arab Emirates, Geochim. Cosmochim. Acta, 1995, 59, 14, 2999-3015, https://doi.org/10.1016/0016-7037(95)00190-5 . [all data]