11-Methyloctacosane

Normal alkane RI, non-polar column, temperature ramp

Data compiled by: NIST Mass Spectrometry Data Center, William E. Wallace, director

Column type Capillary
Active phase BP-1
Column length (m) 12.
Carrier gas Helium
Substrate
Column diameter (mm) 0.22
Phase thickness (μm) 0.25
Tstart (C) 100.
Tend (C) 300.
Heat rate (K/min) 2.
Initial hold (min)
Final hold (min)
I 2835.
ReferenceLockey and Oraha, 1990
Comment MSDC-RI

References

Lockey and Oraha, 1990
Lockey, K.H.; Oraha, V.S., Cuticular lipids of adult Locusta Migratoria Migratoriodes (R and F), Schstocerca Gregaria (Forskal) (Acrididae) and other orthopteran species - II. Hydrocarbons, Comp. Biochem. Physiol., 1990, 95B, 4, 721-744. [all data]