Indane-cis-1,2-diol, 2-(N,N-dimethylaminomethyl)-ferroceneboronate

Normal alkane RI, non-polar column, custom temperature program

Data compiled by: NIST Mass Spectrometry Data Center, William E. Wallace, director

Column type CapillaryCapillary
Active phase CP Sil 5 CBCP Sil 5 CB
Column length (m) 25.25.
Carrier gas HeHe
Substrate
Column diameter (mm) 0.320.32
Phase thickness (μm) 0.120.12
Program 80C(2min) => 30C/min => 180C => 4C/min => 250C80C(2min) => 30C/min => 180C => 4C/min => 250C
I 2665.2675.
ReferenceGamoh, Ketuly, et al., 1994Gamoh, Ketuly, et al., 1994
Comment MSDC-RI MSDC-RI

References

Gamoh, Ketuly, et al., 1994
Gamoh, K.; Ketuly, K.A.; Cole, W.J.; Brooks, C.J.W.; Anderson, R.A., Chromatographic and mass-spectrometric studies of cyclic 2-(N,N-dimethylaminomethyl)ferroceneboronates and related esters, Anal. Sci., 1994, 10, 5, 705-711, https://doi.org/10.2116/analsci.10.705 . [all data]