(2S,3S)-Butane-2,3-diol, 2-(N,N-dimethylaminomethyl)-ferroceneboronate

Normal alkane RI, non-polar column, custom temperature program

View large format table.

Column type Active phase I Reference Comment
CapillaryCP Sil 5 CB1990.Gamoh, Ketuly, et al., 199425. m/0.32 mm/0.12 μm, He; Program: 80C(2min) => 30C/min => 180C => 4C/min => 250C
CapillaryCP Sil 5 CB2010.Gamoh, Ketuly, et al., 199425. m/0.32 mm/0.12 μm, He; Program: 80C(2min) => 30C/min => 180C => 4C/min => 250C

References

Gamoh, Ketuly, et al., 1994
Gamoh, K.; Ketuly, K.A.; Cole, W.J.; Brooks, C.J.W.; Anderson, R.A., Chromatographic and mass-spectrometric studies of cyclic 2-(N,N-dimethylaminomethyl)ferroceneboronates and related esters, Anal. Sci., 1994, 10, 5, 705-711, https://doi.org/10.2116/analsci.10.705 . [all data]