Intermedine

Kovats' RI, non-polar column, temperature ramp

Data compiled by: NIST Mass Spectrometry Data Center, William E. Wallace, director

Column type Capillary
Active phase OV-1
Column length (m) 30.
Carrier gas He
Substrate
Column diameter (mm)
Phase thickness (μm)
Tstart (C) 150.
Tend (C) 300.
Heat rate (K/min) 6.
Initial hold (min)
Final hold (min)
I 2133.
ReferenceEl-Shazly, El-Domiaty, et al., 1998
Comment MSDC-RI

References

El-Shazly, El-Domiaty, et al., 1998
El-Shazly, A.; El-Domiaty, M.; Witte, L.; Wink, M., Pyrrolizidine alkaloids in members of the boraginaceae from Sinai (Egypt), Biochem. Syst. Ecol., 1998, 26, 6, 619-636, https://doi.org/10.1016/S0305-1978(98)00028-3 . [all data]