Nemorensine-isomer

Van Den Dool and Kratz RI, non-polar column, temperature ramp

View large format table.

Column type Active phase I Reference Comment
CapillaryDB-12320.Witte, Rubiolo, et al., 1992He, 6. K/min; Column length: 30. m; Column diameter: 0.32 mm; Tstart: 150. C; Tend: 300. C
CapillaryDB-12340.Witte, Rubiolo, et al., 1992He, 6. K/min; Column length: 30. m; Column diameter: 0.32 mm; Tstart: 150. C; Tend: 300. C
CapillaryOV-12344.Witte, Rubiolo, et al., 199225. m/0.25 mm/0.5 μm, H2, 6. K/min; Tstart: 150. C; Tend: 300. C

Normal alkane RI, non-polar column, custom temperature program

View large format table.

Column type Active phase I Reference Comment
CapillaryDB-12325.Asres, Sporer, et al., 2004He; Column length: 30. m; Column diameter: 0.3 mm; Program: 120C => (6C/min or 1.5C/min) => 300C

References

Witte, Rubiolo, et al., 1992
Witte, L.; Rubiolo, P.; Bicchi, C.; Hartmann, T., Comparative analysis of pyrrolizidine alkaloids from natural sources by gas chromatography-mass spectrometry, Phytochemistry, 1992, 32, 1, 187-196, https://doi.org/10.1016/0031-9422(92)80130-7 . [all data]

Asres, Sporer, et al., 2004
Asres, K.; Sporer, F.; Wink, M., Patterns of pyrrolizidine alkaloids in 12 Ethiopian Crotalaria species, Biochem. Syst. Ecol., 2004, 32, 10, 915-930, https://doi.org/10.1016/j.bse.2004.03.004 . [all data]