Adonifoline

Van Den Dool and Kratz RI, non-polar column, temperature ramp

Data compiled by: NIST Mass Spectrometry Data Center, William E. Wallace, director

Column type CapillaryCapillary
Active phase DB-1OV-1
Column length (m) 30.25.
Carrier gas HeH2
Substrate
Column diameter (mm) 0.320.25
Phase thickness (μm)  0.5
Tstart (C) 150.150.
Tend (C) 300.300.
Heat rate (K/min) 6.6.
Initial hold (min)
Final hold (min)
I 2530.2545.
ReferenceWitte, Rubiolo, et al., 1992Witte, Rubiolo, et al., 1992
Comment MSDC-RI MSDC-RI

References

Witte, Rubiolo, et al., 1992
Witte, L.; Rubiolo, P.; Bicchi, C.; Hartmann, T., Comparative analysis of pyrrolizidine alkaloids from natural sources by gas chromatography-mass spectrometry, Phytochemistry, 1992, 32, 1, 187-196, https://doi.org/10.1016/0031-9422(92)80130-7 . [all data]