2β-OH-GA28, methyl ester TMS ether

Normal alkane RI, non-polar column, custom temperature program

Data compiled by: NIST Mass Spectrometry Data Center, William E. Wallace, director

Column type Capillary
Active phase BP-1
Column length (m) 25.
Carrier gas He
Substrate
Column diameter (mm) 0.25
Phase thickness (μm) 0.33
Program 60C(1min) => 20C/min => 240C => 4C/min => 300C
I 2849.
ReferenceLange, Hedden, et al., 1993
Comment MSDC-RI

References

Lange, Hedden, et al., 1993
Lange, T.; Hedden, P.; Graebe, J.E., Gibberellin biosynthesis in cell-free extracts from developing Cucurbita maxima embryos and the identification of new endogenous gibberellins, Planta, 1993, 189, 3, 350-358, https://doi.org/10.1007/BF00194431 . [all data]