Galaxolide

Van Den Dool and Kratz RI, non-polar column, temperature ramp

Data compiled by: NIST Mass Spectrometry Data Center, William E. Wallace, director

Column type CapillaryCapillary
Active phase DB-1DB-1
Column length (m) 30.30.
Carrier gas
Substrate
Column diameter (mm) 0.250.25
Phase thickness (μm)
Tstart (C) 50.50.
Tend (C) 300.300.
Heat rate (K/min) 2.2.
Initial hold (min)
Final hold (min)
I 1818.51819.2
ReferenceChang, Sheng, et al., 1989Chang, Sheng, et al., 1989
Comment MSDC-RI MSDC-RI

Kovats' RI, non-polar column, isothermal

Data compiled by: NIST Mass Spectrometry Data Center, William E. Wallace, director

Column type Capillary
Active phase SE-30
Column length (m) 40.
Carrier gas
Substrate
Column diameter (mm) 0.35
Phase thickness (μm) 0.35
Temperature (C) 100.
I 1846.9
ReferenceTudor, 1997
Comment MSDC-RI

References

Chang, Sheng, et al., 1989
Chang, L.P.; Sheng, L.S.; Yang, M.Z.; An, D.K., Retention index of essential oil in temperature-programmed capillary column gas chromatography, Acta Pharm. Sin., 1989, 24, 11, 847-852. [all data]