GA29-2-O-glucoside, permethyl

Kovats' RI, non-polar column, temperature ramp

View large format table.

Column type Active phase I Reference Comment
CapillaryCross-Linked Methylsilicone3597.Schneider, Jensen, et al., 199225. m/0.2 mm/0.11 μm, He, 60. C @ 1. min, 30. K/min; Tend: 270. C
CapillaryCross-Linked Methylsilicone3597.Schneider, Jensen, et al., 199225. m/0.2 mm/0.11 μm, He, 60. C @ 1. min, 30. K/min; Tend: 270. C
CapillaryCross-Linked Methylsilicone3600.Schneider, Jensen, et al., 199225. m/0.2 mm/0.11 μm, He, 60. C @ 1. min, 30. K/min; Tend: 270. C
CapillaryCross-Linked Methylsilicone3600.Schneider, Jensen, et al., 199225. m/0.2 mm/0.11 μm, He, 60. C @ 1. min, 30. K/min; Tend: 270. C

References

Schneider, Jensen, et al., 1992
Schneider, G.; Jensen, E.; Spray, C.R.; Phinney, B.O., Hydrolysis and reconjugation of gibberellin A20 glucosyl ester by seedlings of Zea mays L., Proc. Nat. Acad. Sci. U.S.A., 1992, 89, 17, 8045-8048, https://doi.org/10.1073/pnas.89.17.8045 . [all data]