(-)-Bunolol methoxime, PFB-TMS

Normal alkane RI, non-polar column, temperature ramp

View large format table.

Column type Active phase I Reference Comment
CapillaryDB-13051.Watson, Midgley, et al., 199112. m/0.25 mm/0.25 μm, 140. C @ 1. min, 30. K/min, 280. C @ 10. min

References

Watson, Midgley, et al., 1991
Watson, D.G.; Midgley, J.M.; McGhee, C.N.J., Determination of (-)-bunolol and its metabolite, dihydro-(-)-bunolol, in human aqueous humour by gas chromatography-negative ion chemical ionisation mass spectrometry, J. Chromatogr., 1991, 571, 1-2, 101-108, https://doi.org/10.1016/0378-4347(91)80437-H . [all data]