3,4,7-Trimethylnonane, c

Kovats' RI, non-polar column, isothermal

View large format table.

Column type Active phase Temperature (C) I Reference Comment
CapillarySE-3070.1116.25Laet and Tilquin, 1991Column length: 30. m; Column diameter: 0.25 mm

References

Laet and Tilquin, 1991
Laet, M.; Tilquin, B., Identification d'isomeres du dodecane mesures des indices de retention a plusieurs temperatures, Bull. Soc. Chim. Belg., 1991, 100, 4, 345-355, https://doi.org/10.1002/bscb.19911000408 . [all data]