Dibenzodioxin, 1,9-dibromo-, 3,4,6,7-tetrachloro-

Van Den Dool and Kratz RI, non-polar column, temperature ramp

View large format table.

Column type Active phase I Reference Comment
CapillaryRTX-52887.Donnelly, Munslow, et al., 199130. m/0.25 mm/0.25 μm, He, 170. C @ 1. min, 2. K/min; Tend: 320. C
CapillaryRTX-52890.Donnelly, Munslow, et al., 1991, 230. m/0.25 mm/0.25 μm, He, 170. C @ 1. min, 2. K/min; Tend: 320. C
CapillaryRTX-52887.Donnelly, Munslow, et al., 1991, 230. m/0.25 mm/0.25 μm, He, 170. C @ 1. min, 2. K/min; Tend: 320. C

References

Donnelly, Munslow, et al., 1991
Donnelly, J.R.; Munslow, W.D.; Grange, A.H.; Pettit, T.L.; Simmons, R.D.; Sovocool, G.W., Correlation of structure with linear retention index for bromo- and bromochlorodibenzo-p-dioxins and bromodibenzofurans, J. Chromatogr., 1991, 540, 293-310, https://doi.org/10.1016/S0021-9673(01)88817-8 . [all data]

Donnelly, Munslow, et al., 1991, 2
Donnelly, J.R.; Munslow, W.D.; Grange, A.H.; Pettit, T.L.; Simmons, R.D.; Kumar, K.S.; Sovocool, G.W., A gas chromatographic/mass spectrometric approach for isomer-specific environmental monitoring of the 1700 bromo-, chloro-, and bromoschloro-dibenzo-p-dioxins, Biol. Mass Spectrom., 1991, 20, 5, 329-337, https://doi.org/10.1002/bms.1200200515 . [all data]