2-methyl-4,5-dihydro-3-furanthiol

Normal alkane RI, non-polar column, temperature ramp

Data compiled by: NIST Mass Spectrometry Data Center, William E. Wallace, director

Column type CapillaryCapillary
Active phase DB-1DB-1
Column length (m) 60.60.
Carrier gas HeHe
Substrate
Column diameter (mm) 0.320.32
Phase thickness (μm) 0.250.25
Tstart (C) 60.60.
Tend (C) 220.220.
Heat rate (K/min) 3.3.
Initial hold (min)
Final hold (min)
I 919.927.
ReferenceGüntert, Bertram, et al., 1992Guntert, Brüning, et al., 1990
Comment MSDC-RI MSDC-RI

References

Güntert, Bertram, et al., 1992
Güntert, M.; Bertram, H.-J.; Hopp, R.; Silberzahn, W.; Sommer, H.; Werkhoff, P., Thermal generation of flavor compounds from thiamin and various amino acids in Recent developments in flavor and fragrance chemistry. Proceedings of the 3rd International Haarmann Reimer Symposium, Hopp,R.; Mori,K., ed(s)., VCH Publishers, New York, 1992, 215-240. [all data]

Guntert, Brüning, et al., 1990
Guntert, M.; Brüning, J.; Emberger, R.; Köpsel, Ml; Kuhn, W.; Thielmann, T.; Werkhoff, P., Identification and formation of some selected sulfur-containing flavor compounds in various meat model systems, J. Agric. Food Chem., 1990, 38, 11, 2027-2041, https://doi.org/10.1021/jf00101a007 . [all data]