methyl 4-acetoxyoctanoate

Normal alkane RI, non-polar column, temperature ramp

Data compiled by: NIST Mass Spectrometry Data Center, William E. Wallace, director

Column type CapillaryCapillary
Active phase DB-1DB-1
Column length (m) 60.60.
Carrier gas HeHe
Substrate
Column diameter (mm) 0.320.32
Phase thickness (μm)
Tstart (C) 30.30.
Tend (C) 210.210.
Heat rate (K/min) 2.2.
Initial hold (min) 4.4.
Final hold (min)
I 1379.1381.
ReferenceTakeoka and Butter, 1989Takeoka and Butter, 1989
Comment MSDC-RI MSDC-RI

References

Takeoka and Butter, 1989
Takeoka, G.; Butter, R.G., Volatile constituents of pineapple (Ananas Comosus [L.] Merr.) in Flavor Chemistry. Trends and Developments, Teranishi,R.; Buttery,R.G.; Shahidi,F., ed(s)., American Chemical Society, Washington, DC, 1989, 223-237. [all data]