4-Pentenoic acid, 2-(1-oxopropyl), enol-bis-TMS, # 2

Van Den Dool and Kratz RI, non-polar column, custom temperature program

View large format table.

Column type Active phase I Reference Comment
CapillaryDB-11435.Rettenmeier, Howald, et al., 198960. m/0.32 mm/0.25 μm, He; Program: 40 0C "rapidly" -> 80 0C 2 0C/min -> 120 0C 4 0C/min -> 180 0C "rapidly" -> 250 0C

References

Rettenmeier, Howald, et al., 1989
Rettenmeier, A.W.; Howald, W.N.; Levy, R.H.; Witek, D.J.; Gordon, W.P.; Porubek, D.J.; Baillie, T.A., Quantitative metabolic profiling of valproic acid in humans using automated gas chromatographic/mass spectrometric techniques, Biomed. Environ. Mass Spectrom., 1989, 18, 3, 192-199, https://doi.org/10.1002/bms.1200180308 . [all data]