6-Methylpentacosane

Kovats' RI, non-polar column, isothermal

View large format table.

Column type Active phase Temperature (C) I Reference Comment
CapillaryMethyl Silicone210.2544.Pomonis, Hakk, et al., 1989He; Column length: 12.5 m

Normal alkane RI, non-polar column, temperature ramp

View large format table.

Column type Active phase I Reference Comment
CapillaryOV-12547.8Krkosova, Kubinec, et al., 2007100. m/0.32 mm/0.25 μm, Helium, 5. K/min, 310. C @ 5. min; Tstart: 30. C

References

Pomonis, Hakk, et al., 1989
Pomonis, J.G.; Hakk, H.; Fatland, C.L., Synthetic methyl- and dimethylalkanes. Kovats indices [13C]NMR and mass spectra of some methylpentacosanes and 2,X-dimethylheptacosanes, J. Chem. Ecol., 1989, 15, 9, 2319-2333. [all data]

Krkosova, Kubinec, et al., 2007
Krkosova, Z.; Kubinec, R.; Addova, G.; Jurdakova, H.; Blasko, J.; Ostrovsky, I.; Sojak, L., Gas chromatographic - mass spectrometric characterization of monomethylalkanes from fuel diesel, Petroleum Coal, 2007, 49, 3, 51-62. [all data]