Pentacosane, 5-methyl

Normal alkane RI, non-polar column, temperature ramp

Data compiled by: NIST Mass Spectrometry Data Center, William E. Wallace, director

Column type CapillaryCapillaryCapillary
Active phase OV-1BP-1BP-1
Column length (m) 100.25.25.
Carrier gas HeliumHeliumHelium
Substrate
Column diameter (mm) 0.320.250.25
Phase thickness (μm) 0.250.250.25
Tstart (C) 30.160.160.
Tend (C) 310.300.300.
Heat rate (K/min) 5.1.51.5
Initial hold (min)
Final hold (min) 5.
I 2553.22553.2554.
ReferenceKrkosova, Kubinec, et al., 2007Lockey and Dularay, 1986Lockey and Dularay, 1986
Comment MSDC-RI MSDC-RI MSDC-RI

References

Krkosova, Kubinec, et al., 2007
Krkosova, Z.; Kubinec, R.; Addova, G.; Jurdakova, H.; Blasko, J.; Ostrovsky, I.; Sojak, L., Gas chromatographic - mass spectrometric characterization of monomethylalkanes from fuel diesel, Petroleum Coal, 2007, 49, 3, 51-62. [all data]

Lockey and Dularay, 1986
Lockey, K.H.; Dularay, B., Cuticular methylalkanes of adult cockroaches, Blatta orientalis and Periplaneta Americana, Comp. Biochem. Physiol., 1986, 85B, 3, 567-572. [all data]