13,17-Dimethylheptatriacontane

Normal alkane RI, non-polar column, custom temperature program

Data compiled by: NIST Mass Spectrometry Data Center, William E. Wallace, director

Column type CapillaryCapillary
Active phase DB-1CP Sil 5 CB
Column length (m) 30.25.
Carrier gas HeHe
Substrate
Column diameter (mm) 0.320.32
Phase thickness (μm) 0.250.2
Program 60C (2min) => 10C/min => 220C => 3C/min => 310C (12 - 42 min)50C => 20C/min => 130C => 4C/min => 300C (20min)
I 3755.3758.
ReferenceCarlson, Geden, et al., 1999Kenig, Sinninghe Damsté, et al., 1995
Comment MSDC-RI MSDC-RI

Normal alkane RI, non-polar column, temperature ramp

Data compiled by: NIST Mass Spectrometry Data Center, William E. Wallace, director

Column type CapillaryPacked
Active phase Ultra-1OV-101
Column length (m) 12.53.
Carrier gas HeHelium
Substrate  Gas-Chrom Q (100-120 mesh)
Column diameter (mm) 0.2
Phase thickness (μm)
Tstart (C) 150.150.
Tend (C) 320.320.
Heat rate (K/min) 4.3.
Initial hold (min)
Final hold (min)  25.
I 3758.3758.
ReferenceNelson and Charlet, 2003Nelson, de Renobales, et al., 1989
Comment MSDC-RI MSDC-RI

Van Den Dool and Kratz RI, non-polar column, temperature ramp

Data compiled by: NIST Mass Spectrometry Data Center, William E. Wallace, director

Column type Capillary
Active phase Ultra-1
Column length (m) 12.
Carrier gas
Substrate
Column diameter (mm) 0.2
Phase thickness (μm)
Tstart (C) 150.
Tend (C) 320.
Heat rate (K/min) 4.
Initial hold (min) 4.
Final hold (min) 30.
I 3758.
ReferenceNelson, Adams, et al., 2003
Comment MSDC-RI

References

Carlson, Geden, et al., 1999
Carlson, D.A.; Geden, C.J.; Bernier, U.R., Identification of pupal exiviae of Nasania vitripennis and Muscidifurax raptorellus parasitoids using cuticular hydrocarbons, Biol. Control, 1999, 15, 2, 97-106, https://doi.org/10.1006/bcon.1999.0708 . [all data]

Kenig, Sinninghe Damsté, et al., 1995
Kenig, F.; Sinninghe Damsté, J.S.; Kock-van Dalen, A.C.; Rijpstra, W.I.C.; Huc, A.Y.; de Leeuw, J.W., Occurrence and origin of mono-, di-, and trimethylalkanes in modern and holocene cyanobacterial mats from Abu Dhabi, United Arab Emirates, Geochim. Cosmochim. Acta, 1995, 59, 14, 2999-3015, https://doi.org/10.1016/0016-7037(95)00190-5 . [all data]